SAME70-XPLAINED - Build Failure with an unmodified version of the USB MSC example

Go To Last Post
6 posts / 0 new
Author
Message
#1
  • 1
  • 2
  • 3
  • 4
  • 5
Total votes: 0

Hi all,

I've been sitting scratching my head for an hour or so now and have no clue as to how to proceed.  Brand new installation of Atmel Studio (v7.0.1645), the SAME70 Xplained board was recognised and updated to the latest firmware, picked the USB MSC device example for the SAME70.

 

I hit build and then got an error??  Surely the whole point of these examples is that they work so that you can then fiddle with them till they break.

 

Here's the output log I got from the build:

 

------ Build started: Project: SAME70_USB_MSC, Configuration: Debug ARM ------
Build started.
Project "SAME70_USB_MSC.cproj" (default targets):
Target "PreBuildEvent" skipped, due to false condition; ('$(PreBuildEvent)'!='') was evaluated as (''!='').
Target "CoreBuild" in file "C:\Program Files (x86)\Atmel\Studio\7.0\Vs\Compiler.targets" from project "E:\Projects\AtmelStudio\SAME70_USB_MSC\SAME70_USB_MSC\SAME70_USB_MSC.cproj" (target "Build" depends on it):
    Task "RunCompilerTask"
        Shell Utils Path C:\Program Files (x86)\Atmel\Studio\7.0\shellUtils
        C:\Program Files (x86)\Atmel\Studio\7.0\shellUtils\make.exe all --jobs 8 --output-sync
E:\Projects\AtmelStudio\SAME70_USB_MSC\SAME70_USB_MSC\Debug\Makefile(281,1): error: recipe for target 'src/ASF/common/services/usb/class/msc/device/example/same70q21_same70_xplained/ui.o' failed
        make: *** [src/ASF/common/services/usb/class/msc/device/example/same70q21_same70_xplained/ui.o] Error 1
        make: *** Waiting for unfinished jobs....
E:\Projects\AtmelStudio\SAME70_USB_MSC\SAME70_USB_MSC\Debug\Makefile(288,1): error: recipe for target 'src/ASF/common/components/memory/virtual_mem/virtual_mem.o' failed
        make: *** [src/ASF/common/components/memory/virtual_mem/virtual_mem.o] Error 1
E:\Projects\AtmelStudio\SAME70_USB_MSC\SAME70_USB_MSC\Debug\Makefile(295,1): error: recipe for target 'src/ASF/common/services/clock/same70/sysclk.o' failed
        make: *** [src/ASF/common/services/clock/same70/sysclk.o] Error 1
E:\Projects\AtmelStudio\SAME70_USB_MSC\SAME70_USB_MSC\Debug\Makefile(302,1): error: recipe for target 'src/ASF/common/services/sleepmgr/sam/sleepmgr.o' failed
        make: *** [src/ASF/common/services/sleepmgr/sam/sleepmgr.o] Error 1
    Done executing task "RunCompilerTask" -- FAILED.
Done building target "CoreBuild" in project "SAME70_USB_MSC.cproj" -- FAILED.
Done building project "SAME70_USB_MSC.cproj" -- FAILED.

Build FAILED.
========== Build: 0 succeeded or up-to-date, 1 failed, 0 skipped ==========

 

Any help would be appreciated,

Lee

 

Last Edited: Mon. Feb 12, 2018 - 11:33 AM
  • 1
  • 2
  • 3
  • 4
  • 5
Total votes: 0

Something is different with your setup.  I just created the same example project on my setup and it builds without errors.

 

Try opening the project, click on just the first file 'src/ASF/common/services/usb/class/msc/device/example/same70q21_same70_xplained/ui.c', then from the main menu "Build->Compile".  This will compile just this file rather than spawn multiple threads and compile multiple source files in parallel.  Post both the output window and error list window.

  • 1
  • 2
  • 3
  • 4
  • 5
Total votes: 0

Thanks for the reply.  What version of Studio are you using?  I've read somewhere that the version of GCC built in has been incremented with a fairly recent release.  I'm wondering if they've updated GCC and broken a whole load of examples.

 

OUTPUT WINDOW:

Build started.

Project "SAME70_USB_MSC.cproj" (Compile target(s)):

Target "Compile" in file "C:\Program Files (x86)\Atmel\Studio\7.0\Vs\Compiler.targets" from project "E:\Projects\AtmelStudio\SAME70_USB_MSC\SAME70_USB_MSC\SAME70_USB_MSC.cproj" (entry point):

Using "RunCompilerTask" task from assembly "C:\Program Files (x86)\Atmel\Studio\7.0\Extensions\Application\AvrGCC.dll".

Task "RunCompilerTask"

Shell Utils Path C:\Program Files (x86)\Atmel\Studio\7.0\shellUtils

C:\Program Files (x86)\Atmel\Studio\7.0\shellUtils\make.exe "src/ASF/common/services/usb/class/msc/device/example/same70q21_same70_xplained/ui.o" 

E:\Projects\AtmelStudio\SAME70_USB_MSC\SAME70_USB_MSC\Debug\Makefile(280,1): error: recipe for target 'src/ASF/common/services/usb/class/msc/device/example/same70q21_same70_xplained/ui.o' failed

make: *** [src/ASF/common/services/usb/class/msc/device/example/same70q21_same70_xplained/ui.o] Error 1

Done executing task "RunCompilerTask" -- FAILED.

Done building target "Compile" in project "SAME70_USB_MSC.cproj" -- FAILED.

Done building project "SAME70_USB_MSC.cproj" -- FAILED.

Build FAILED.

 

ERROR LIST:

Severity Code Description Project File Line

Error recipe for target 'src/ASF/common/services/usb/class/msc/device/example/same70q21_same70_xplained/ui.o' failed SAME70_USB_MSC E:\Projects\AtmelStudio\SAME70_USB_MSC\SAME70_USB_MSC\Debug\Makefile 280

 

MAKEFILE LINE 280:

src/ASF/common/services/usb/class/msc/device/example/same70q21_same70_xplained/%.o: ../src/ASF/common/services/usb/class/msc/device/example/same70q21_same70_xplained/%.c

@echo Building file: $<

@echo Invoking: ARM/GNU C Compiler : 6.3.1

$(QUOTE)C:\Program Files (x86)\Atmel\Studio\7.0\toolchain\arm\arm-gnu-toolchain\bin\arm-none-eabi-gcc.exe$(QUOTE)  -x c -mthumb -D__SAME70Q21__ -DDEBUG -DBOARD=SAME70_XPLAINED -DVIRTUAL_MEMORY_ENABLE -DARM_MATH_CM7=true -Dprintf=iprintf -DUDD_ENABLE -D__SAME70Q21__ -Dscanf=iscanf -DACCESS_USB_ENABLED  -I"../src/ASF/common/components/memory/virtual_mem" -I"../src/ASF/common/services/storage/ctrl_access" -I"../src" -I"../src/ASF/common/services/clock" -I"../src/ASF/sam/drivers/pmc" -I"../src/ASF/sam/utils" -I"../src/ASF/sam/utils/header_files" -I"../src/ASF/sam/utils/preprocessor" -I"../src/ASF/thirdparty/CMSIS/Include" -I"../src/ASF/thirdparty/CMSIS/Lib/GCC" -I"../src/ASF/sam/utils/fpu" -I"../src/ASF/common/utils" -I"../src/ASF/sam/utils/cmsis/same70/include" -I"../src/ASF/sam/utils/cmsis/same70/source/templates" -I"../src/ASF/common/services/sleepmgr" -I"../src/ASF/common/services/usb/class/msc/device" -I"../src/ASF/common/services/usb/class/msc" -I"../src/ASF/common/services/usb/udc" -I"../src/ASF/sam/drivers/usbhs" -I"../src/ASF/common/services/ioport" -I"../src/ASF/sam/drivers/pio" -I"../src/ASF/common/services/usb" -I"../src/ASF/sam/boards/same70_xplained" -I"../src/ASF/sam/boards" -I"../src/ASF/common/boards" -I"../src/ASF/common/services/gpio" -I"../src/ASF/sam/drivers/mpu" -I"../src/config"  -O1 -fdata-sections -ffunction-sections -mlong-calls -g3 -Wall -mcpu=cortex-m7 -c -pipe -fno-strict-aliasing -Wall -Wstrict-prototypes -Wmissing-prototypes -Werror-implicit-function-declaration -Wpointer-arith -std=gnu99 -ffunction-sections -fdata-sections -Wchar-subscripts -Wcomment -Wformat=2 -Wimplicit-int -Wmain -Wparentheses -Wsequence-point -Wreturn-type -Wswitch -Wtrigraphs -Wunused -Wuninitialized -Wunknown-pragmas -Wfloat-equal -Wundef -Wshadow -Wbad-function-cast -Wwrite-strings -Wsign-compare -Waggregate-return -Wmissing-declarations -Wformat -Wmissing-format-attribute -Wno-deprecated-declarations -Wpacked -Wredundant-decls -Wnested-externs -Wlong-long -Wunreachable-code -Wcast-align --param max-inline-insns-single=500 -mfloat-abi=softfp -mfpu=fpv5-sp-d16 -MD -MP -MF "$(@:%.o=%.d)" -MT"$(@:%.o=%.d)" -MT"$(@:%.o=%.o)"   -o "$@" "$<" 

@echo Finished building: $<

  • 1
  • 2
  • 3
  • 4
  • 5
Total votes: 0

Same version of Atmel Studio as yours - 7.0.1645.  I have it running under the latest Win 10 version (1709)

 

Long shot but try moving your project from the e: drive to the c: drive, making sure there are no spaces in the path as well.  I've seen problems with scripts before due to directory/path errors.

  • 1
  • 2
  • 3
  • 4
  • 5
Total votes: 0

I'm running under Windows 7. I've tried different directories on C: and E:, running as administrator and disabling anti-virus. I've even tried installing Atmel Studio on another machine (unfortunately also running under Windows 7) but have gotten exactly the same result.

So frustrated!  I've a £30 board that I can't compile to with the manufacturers tools!  Worse than that though, it's looking like I can't use the chip I wanted too because of something which shouldn't be happening.

  • 1
  • 2
  • 3
  • 4
  • 5
Total votes: 0

Just tried the "USB Device MSC Example - SAME70-XPLD" on AS 7.0.1645 in Win7x64 SP1 and for me also worked fine.

Here's the output (tried to use same path as yours so that you can compare):

------ Build started: Project: SAME70_USB_MSC, Configuration: Debug ARM ------
Build started.
Project "SAME70_USB_MSC.cproj" (default targets):
Target "PreBuildEvent" skipped, due to false condition; ('$(PreBuildEvent)'!='') was evaluated as (''!='').
Target "CoreBuild" in file "C:\Program Files (x86)\Atmel\Studio\7.0\Vs\Compiler.targets" from project "E:\Projects\AtmelStudio\SAME70_USB_MSC\SAME70_USB_MSC\SAME70_USB_MSC.cproj" (target "Build" depends on it):
	Using "RunCompilerTask" task from assembly "C:\Program Files (x86)\Atmel\Studio\7.0\Extensions\Application\AvrGCC.dll".
	Task "RunCompilerTask"
		Shell Utils Path C:\Program Files (x86)\Atmel\Studio\7.0\shellUtils
		C:\Program Files (x86)\Atmel\Studio\7.0\shellUtils\make.exe all --jobs 8 --output-sync 
		Building file: ../src/ASF/common/services/clock/same70/sysclk.c
		Invoking: ARM/GNU C Compiler : 6.3.1
		"C:\Program Files (x86)\Atmel\Studio\7.0\toolchain\arm\arm-gnu-toolchain\bin\arm-none-eabi-gcc.exe"  -x c -mthumb -D__SAME70Q21__ -DDEBUG -DBOARD=SAME70_XPLAINED -DVIRTUAL_MEMORY_ENABLE -DARM_MATH_CM7=true -Dprintf=iprintf -DUDD_ENABLE -D__SAME70Q21__ -Dscanf=iscanf -DACCESS_USB_ENABLED  -I"../src/ASF/common/components/memory/virtual_mem" -I"../src/ASF/common/services/storage/ctrl_access" -I"../src" -I"../src/ASF/common/services/clock" -I"../src/ASF/sam/drivers/pmc" -I"../src/ASF/sam/utils" -I"../src/ASF/sam/utils/header_files" -I"../src/ASF/sam/utils/preprocessor" -I"../src/ASF/thirdparty/CMSIS/Include" -I"../src/ASF/thirdparty/CMSIS/Lib/GCC" -I"../src/ASF/sam/utils/fpu" -I"../src/ASF/common/utils" -I"../src/ASF/sam/utils/cmsis/same70/include" -I"../src/ASF/sam/utils/cmsis/same70/source/templates" -I"../src/ASF/common/services/sleepmgr" -I"../src/ASF/common/services/usb/class/msc/device" -I"../src/ASF/common/services/usb/class/msc" -I"../src/ASF/common/services/usb/udc" -I"../src/ASF/sam/drivers/usbhs" -I"../src/ASF/common/services/ioport" -I"../src/ASF/sam/drivers/pio" -I"../src/ASF/common/services/usb" -I"../src/ASF/sam/boards/same70_xplained" -I"../src/ASF/sam/boards" -I"../src/ASF/common/boards" -I"../src/ASF/common/services/gpio" -I"../src/ASF/sam/drivers/mpu" -I"../src/config"  -O1 -fdata-sections -ffunction-sections -mlong-calls -g3 -Wall -mcpu=cortex-m7 -c -pipe -fno-strict-aliasing -Wall -Wstrict-prototypes -Wmissing-prototypes -Werror-implicit-function-declaration -Wpointer-arith -std=gnu99 -ffunction-sections -fdata-sections -Wchar-subscripts -Wcomment -Wformat=2 -Wimplicit-int -Wmain -Wparentheses -Wsequence-point -Wreturn-type -Wswitch -Wtrigraphs -Wunused -Wuninitialized -Wunknown-pragmas -Wfloat-equal -Wundef -Wshadow -Wbad-function-cast -Wwrite-strings -Wsign-compare -Waggregate-return -Wmissing-declarations -Wformat -Wmissing-format-attribute -Wno-deprecated-declarations -Wpacked -Wredundant-decls -Wnested-externs -Wlong-long -Wunreachable-code -Wcast-align --param max-inline-insns-single=500 -mfloat-abi=softfp -mfpu=fpv5-sp-d16 -MD -MP -MF "src/ASF/common/services/clock/same70/sysclk.d" -MT"src/ASF/common/services/clock/same70/sysclk.d" -MT"src/ASF/common/services/clock/same70/sysclk.o"   -o "src/ASF/common/services/clock/same70/sysclk.o" "../src/ASF/common/services/clock/same70/sysclk.c" 
		Finished building: ../src/ASF/common/services/clock/same70/sysclk.c
		Building file: ../src/ASF/common/components/memory/virtual_mem/virtual_mem.c
		Invoking: ARM/GNU C Compiler : 6.3.1
		"C:\Program Files (x86)\Atmel\Studio\7.0\toolchain\arm\arm-gnu-toolchain\bin\arm-none-eabi-gcc.exe"  -x c -mthumb -D__SAME70Q21__ -DDEBUG -DBOARD=SAME70_XPLAINED -DVIRTUAL_MEMORY_ENABLE -DARM_MATH_CM7=true -Dprintf=iprintf -DUDD_ENABLE -D__SAME70Q21__ -Dscanf=iscanf -DACCESS_USB_ENABLED  -I"../src/ASF/common/components/memory/virtual_mem" -I"../src/ASF/common/services/storage/ctrl_access" -I"../src" -I"../src/ASF/common/services/clock" -I"../src/ASF/sam/drivers/pmc" -I"../src/ASF/sam/utils" -I"../src/ASF/sam/utils/header_files" -I"../src/ASF/sam/utils/preprocessor" -I"../src/ASF/thirdparty/CMSIS/Include" -I"../src/ASF/thirdparty/CMSIS/Lib/GCC" -I"../src/ASF/sam/utils/fpu" -I"../src/ASF/common/utils" -I"../src/ASF/sam/utils/cmsis/same70/include" -I"../src/ASF/sam/utils/cmsis/same70/source/templates" -I"../src/ASF/common/services/sleepmgr" -I"../src/ASF/common/services/usb/class/msc/device" -I"../src/ASF/common/services/usb/class/msc" -I"../src/ASF/common/services/usb/udc" -I"../src/ASF/sam/drivers/usbhs" -I"../src/ASF/common/services/ioport" -I"../src/ASF/sam/drivers/pio" -I"../src/ASF/common/services/usb" -I"../src/ASF/sam/boards/same70_xplained" -I"../src/ASF/sam/boards" -I"../src/ASF/common/boards" -I"../src/ASF/common/services/gpio" -I"../src/ASF/sam/drivers/mpu" -I"../src/config"  -O1 -fdata-sections -ffunction-sections -mlong-calls -g3 -Wall -mcpu=cortex-m7 -c -pipe -fno-strict-aliasing -Wall -Wstrict-prototypes -Wmissing-prototypes -Werror-implicit-function-declaration -Wpointer-arith -std=gnu99 -ffunction-sections -fdata-sections -Wchar-subscripts -Wcomment -Wformat=2 -Wimplicit-int -Wmain -Wparentheses -Wsequence-point -Wreturn-type -Wswitch -Wtrigraphs -Wunused -Wuninitialized -Wunknown-pragmas -Wfloat-equal -Wundef -Wshadow -Wbad-function-cast -Wwrite-strings -Wsign-compare -Waggregate-return -Wmissing-declarations -Wformat -Wmissing-format-attribute -Wno-deprecated-declarations -Wpacked -Wredundant-decls -Wnested-externs -Wlong-long -Wunreachable-code -Wcast-align --param max-inline-insns-single=500 -mfloat-abi=softfp -mfpu=fpv5-sp-d16 -MD -MP -MF "src/ASF/common/components/memory/virtual_mem/virtual_mem.d" -MT"src/ASF/common/components/memory/virtual_mem/virtual_mem.d" -MT"src/ASF/common/components/memory/virtual_mem/virtual_mem.o"   -o "src/ASF/common/components/memory/virtual_mem/virtual_mem.o" "../src/ASF/common/components/memory/virtual_mem/virtual_mem.c" 
		Finished building: ../src/ASF/common/components/memory/virtual_mem/virtual_mem.c
		Building file: ../src/ASF/common/services/usb/class/msc/device/example/same70q21_same70_xplained/ui.c
		Invoking: ARM/GNU C Compiler : 6.3.1
		"C:\Program Files (x86)\Atmel\Studio\7.0\toolchain\arm\arm-gnu-toolchain\bin\arm-none-eabi-gcc.exe"  -x c -mthumb -D__SAME70Q21__ -DDEBUG -DBOARD=SAME70_XPLAINED -DVIRTUAL_MEMORY_ENABLE -DARM_MATH_CM7=true -Dprintf=iprintf -DUDD_ENABLE -D__SAME70Q21__ -Dscanf=iscanf -DACCESS_USB_ENABLED  -I"../src/ASF/common/components/memory/virtual_mem" -I"../src/ASF/common/services/storage/ctrl_access" -I"../src" -I"../src/ASF/common/services/clock" -I"../src/ASF/sam/drivers/pmc" -I"../src/ASF/sam/utils" -I"../src/ASF/sam/utils/header_files" -I"../src/ASF/sam/utils/preprocessor" -I"../src/ASF/thirdparty/CMSIS/Include" -I"../src/ASF/thirdparty/CMSIS/Lib/GCC" -I"../src/ASF/sam/utils/fpu" -I"../src/ASF/common/utils" -I"../src/ASF/sam/utils/cmsis/same70/include" -I"../src/ASF/sam/utils/cmsis/same70/source/templates" -I"../src/ASF/common/services/sleepmgr" -I"../src/ASF/common/services/usb/class/msc/device" -I"../src/ASF/common/services/usb/class/msc" -I"../src/ASF/common/services/usb/udc" -I"../src/ASF/sam/drivers/usbhs" -I"../src/ASF/common/services/ioport" -I"../src/ASF/sam/drivers/pio" -I"../src/ASF/common/services/usb" -I"../src/ASF/sam/boards/same70_xplained" -I"../src/ASF/sam/boards" -I"../src/ASF/common/boards" -I"../src/ASF/common/services/gpio" -I"../src/ASF/sam/drivers/mpu" -I"../src/config"  -O1 -fdata-sections -ffunction-sections -mlong-calls -g3 -Wall -mcpu=cortex-m7 -c -pipe -fno-strict-aliasing -Wall -Wstrict-prototypes -Wmissing-prototypes -Werror-implicit-function-declaration -Wpointer-arith -std=gnu99 -ffunction-sections -fdata-sections -Wchar-subscripts -Wcomment -Wformat=2 -Wimplicit-int -Wmain -Wparentheses -Wsequence-point -Wreturn-type -Wswitch -Wtrigraphs -Wunused -Wuninitialized -Wunknown-pragmas -Wfloat-equal -Wundef -Wshadow -Wbad-function-cast -Wwrite-strings -Wsign-compare -Waggregate-return -Wmissing-declarations -Wformat -Wmissing-format-attribute -Wno-deprecated-declarations -Wpacked -Wredundant-decls -Wnested-externs -Wlong-long -Wunreachable-code -Wcast-align --param max-inline-insns-single=500 -mfloat-abi=softfp -mfpu=fpv5-sp-d16 -MD -MP -MF "src/ASF/common/services/usb/class/msc/device/example/same70q21_same70_xplained/ui.d" -MT"src/ASF/common/services/usb/class/msc/device/example/same70q21_same70_xplained/ui.d" -MT"src/ASF/common/services/usb/class/msc/device/example/same70q21_same70_xplained/ui.o"   -o "src/ASF/common/services/usb/class/msc/device/example/same70q21_same70_xplained/ui.o" "../src/ASF/common/services/usb/class/msc/device/example/same70q21_same70_xplained/ui.c" 
		Finished building: ../src/ASF/common/services/usb/class/msc/device/example/same70q21_same70_xplained/ui.c
		Building file: ../src/ASF/common/services/sleepmgr/sam/sleepmgr.c
		Invoking: ARM/GNU C Compiler : 6.3.1
		"C:\Program Files (x86)\Atmel\Studio\7.0\toolchain\arm\arm-gnu-toolchain\bin\arm-none-eabi-gcc.exe"  -x c -mthumb -D__SAME70Q21__ -DDEBUG -DBOARD=SAME70_XPLAINED -DVIRTUAL_MEMORY_ENABLE -DARM_MATH_CM7=true -Dprintf=iprintf -DUDD_ENABLE -D__SAME70Q21__ -Dscanf=iscanf -DACCESS_USB_ENABLED  -I"../src/ASF/common/components/memory/virtual_mem" -I"../src/ASF/common/services/storage/ctrl_access" -I"../src" -I"../src/ASF/common/services/clock" -I"../src/ASF/sam/drivers/pmc" -I"../src/ASF/sam/utils" -I"../src/ASF/sam/utils/header_files" -I"../src/ASF/sam/utils/preprocessor" -I"../src/ASF/thirdparty/CMSIS/Include" -I"../src/ASF/thirdparty/CMSIS/Lib/GCC" -I"../src/ASF/sam/utils/fpu" -I"../src/ASF/common/utils" -I"../src/ASF/sam/utils/cmsis/same70/include" -I"../src/ASF/sam/utils/cmsis/same70/source/templates" -I"../src/ASF/common/services/sleepmgr" -I"../src/ASF/common/services/usb/class/msc/device" -I"../src/ASF/common/services/usb/class/msc" -I"../src/ASF/common/services/usb/udc" -I"../src/ASF/sam/drivers/usbhs" -I"../src/ASF/common/services/ioport" -I"../src/ASF/sam/drivers/pio" -I"../src/ASF/common/services/usb" -I"../src/ASF/sam/boards/same70_xplained" -I"../src/ASF/sam/boards" -I"../src/ASF/common/boards" -I"../src/ASF/common/services/gpio" -I"../src/ASF/sam/drivers/mpu" -I"../src/config"  -O1 -fdata-sections -ffunction-sections -mlong-calls -g3 -Wall -mcpu=cortex-m7 -c -pipe -fno-strict-aliasing -Wall -Wstrict-prototypes -Wmissing-prototypes -Werror-implicit-function-declaration -Wpointer-arith -std=gnu99 -ffunction-sections -fdata-sections -Wchar-subscripts -Wcomment -Wformat=2 -Wimplicit-int -Wmain -Wparentheses -Wsequence-point -Wreturn-type -Wswitch -Wtrigraphs -Wunused -Wuninitialized -Wunknown-pragmas -Wfloat-equal -Wundef -Wshadow -Wbad-function-cast -Wwrite-strings -Wsign-compare -Waggregate-return -Wmissing-declarations -Wformat -Wmissing-format-attribute -Wno-deprecated-declarations -Wpacked -Wredundant-decls -Wnested-externs -Wlong-long -Wunreachable-code -Wcast-align --param max-inline-insns-single=500 -mfloat-abi=softfp -mfpu=fpv5-sp-d16 -MD -MP -MF "src/ASF/common/services/sleepmgr/sam/sleepmgr.d" -MT"src/ASF/common/services/sleepmgr/sam/sleepmgr.d" -MT"src/ASF/common/services/sleepmgr/sam/sleepmgr.o"   -o "src/ASF/common/services/sleepmgr/sam/sleepmgr.o" "../src/ASF/common/services/sleepmgr/sam/sleepmgr.c" 
		Finished building: ../src/ASF/common/services/sleepmgr/sam/sleepmgr.c
		Building file: ../src/ASF/common/services/usb/class/msc/device/udi_msc_desc.c
		Invoking: ARM/GNU C Compiler : 6.3.1
		"C:\Program Files (x86)\Atmel\Studio\7.0\toolchain\arm\arm-gnu-toolchain\bin\arm-none-eabi-gcc.exe"  -x c -mthumb -D__SAME70Q21__ -DDEBUG -DBOARD=SAME70_XPLAINED -DVIRTUAL_MEMORY_ENABLE -DARM_MATH_CM7=true -Dprintf=iprintf -DUDD_ENABLE -D__SAME70Q21__ -Dscanf=iscanf -DACCESS_USB_ENABLED  -I"../src/ASF/common/components/memory/virtual_mem" -I"../src/ASF/common/services/storage/ctrl_access" -I"../src" -I"../src/ASF/common/services/clock" -I"../src/ASF/sam/drivers/pmc" -I"../src/ASF/sam/utils" -I"../src/ASF/sam/utils/header_files" -I"../src/ASF/sam/utils/preprocessor" -I"../src/ASF/thirdparty/CMSIS/Include" -I"../src/ASF/thirdparty/CMSIS/Lib/GCC" -I"../src/ASF/sam/utils/fpu" -I"../src/ASF/common/utils" -I"../src/ASF/sam/utils/cmsis/same70/include" -I"../src/ASF/sam/utils/cmsis/same70/source/templates" -I"../src/ASF/common/services/sleepmgr" -I"../src/ASF/common/services/usb/class/msc/device" -I"../src/ASF/common/services/usb/class/msc" -I"../src/ASF/common/services/usb/udc" -I"../src/ASF/sam/drivers/usbhs" -I"../src/ASF/common/services/ioport" -I"../src/ASF/sam/drivers/pio" -I"../src/ASF/common/services/usb" -I"../src/ASF/sam/boards/same70_xplained" -I"../src/ASF/sam/boards" -I"../src/ASF/common/boards" -I"../src/ASF/common/services/gpio" -I"../src/ASF/sam/drivers/mpu" -I"../src/config"  -O1 -fdata-sections -ffunction-sections -mlong-calls -g3 -Wall -mcpu=cortex-m7 -c -pipe -fno-strict-aliasing -Wall -Wstrict-prototypes -Wmissing-prototypes -Werror-implicit-function-declaration -Wpointer-arith -std=gnu99 -ffunction-sections -fdata-sections -Wchar-subscripts -Wcomment -Wformat=2 -Wimplicit-int -Wmain -Wparentheses -Wsequence-point -Wreturn-type -Wswitch -Wtrigraphs -Wunused -Wuninitialized -Wunknown-pragmas -Wfloat-equal -Wundef -Wshadow -Wbad-function-cast -Wwrite-strings -Wsign-compare -Waggregate-return -Wmissing-declarations -Wformat -Wmissing-format-attribute -Wno-deprecated-declarations -Wpacked -Wredundant-decls -Wnested-externs -Wlong-long -Wunreachable-code -Wcast-align --param max-inline-insns-single=500 -mfloat-abi=softfp -mfpu=fpv5-sp-d16 -MD -MP -MF "src/ASF/common/services/usb/class/msc/device/udi_msc_desc.d" -MT"src/ASF/common/services/usb/class/msc/device/udi_msc_desc.d" -MT"src/ASF/common/services/usb/class/msc/device/udi_msc_desc.o"   -o "src/ASF/common/services/usb/class/msc/device/udi_msc_desc.o" "../src/ASF/common/services/usb/class/msc/device/udi_msc_desc.c" 
		Finished building: ../src/ASF/common/services/usb/class/msc/device/udi_msc_desc.c
		Building file: ../src/ASF/common/services/storage/ctrl_access/ctrl_access.c
		Invoking: ARM/GNU C Compiler : 6.3.1
		"C:\Program Files (x86)\Atmel\Studio\7.0\toolchain\arm\arm-gnu-toolchain\bin\arm-none-eabi-gcc.exe"  -x c -mthumb -D__SAME70Q21__ -DDEBUG -DBOARD=SAME70_XPLAINED -DVIRTUAL_MEMORY_ENABLE -DARM_MATH_CM7=true -Dprintf=iprintf -DUDD_ENABLE -D__SAME70Q21__ -Dscanf=iscanf -DACCESS_USB_ENABLED  -I"../src/ASF/common/components/memory/virtual_mem" -I"../src/ASF/common/services/storage/ctrl_access" -I"../src" -I"../src/ASF/common/services/clock" -I"../src/ASF/sam/drivers/pmc" -I"../src/ASF/sam/utils" -I"../src/ASF/sam/utils/header_files" -I"../src/ASF/sam/utils/preprocessor" -I"../src/ASF/thirdparty/CMSIS/Include" -I"../src/ASF/thirdparty/CMSIS/Lib/GCC" -I"../src/ASF/sam/utils/fpu" -I"../src/ASF/common/utils" -I"../src/ASF/sam/utils/cmsis/same70/include" -I"../src/ASF/sam/utils/cmsis/same70/source/templates" -I"../src/ASF/common/services/sleepmgr" -I"../src/ASF/common/services/usb/class/msc/device" -I"../src/ASF/common/services/usb/class/msc" -I"../src/ASF/common/services/usb/udc" -I"../src/ASF/sam/drivers/usbhs" -I"../src/ASF/common/services/ioport" -I"../src/ASF/sam/drivers/pio" -I"../src/ASF/common/services/usb" -I"../src/ASF/sam/boards/same70_xplained" -I"../src/ASF/sam/boards" -I"../src/ASF/common/boards" -I"../src/ASF/common/services/gpio" -I"../src/ASF/sam/drivers/mpu" -I"../src/config"  -O1 -fdata-sections -ffunction-sections -mlong-calls -g3 -Wall -mcpu=cortex-m7 -c -pipe -fno-strict-aliasing -Wall -Wstrict-prototypes -Wmissing-prototypes -Werror-implicit-function-declaration -Wpointer-arith -std=gnu99 -ffunction-sections -fdata-sections -Wchar-subscripts -Wcomment -Wformat=2 -Wimplicit-int -Wmain -Wparentheses -Wsequence-point -Wreturn-type -Wswitch -Wtrigraphs -Wunused -Wuninitialized -Wunknown-pragmas -Wfloat-equal -Wundef -Wshadow -Wbad-function-cast -Wwrite-strings -Wsign-compare -Waggregate-return -Wmissing-declarations -Wformat -Wmissing-format-attribute -Wno-deprecated-declarations -Wpacked -Wredundant-decls -Wnested-externs -Wlong-long -Wunreachable-code -Wcast-align --param max-inline-insns-single=500 -mfloat-abi=softfp -mfpu=fpv5-sp-d16 -MD -MP -MF "src/ASF/common/services/storage/ctrl_access/ctrl_access.d" -MT"src/ASF/common/services/storage/ctrl_access/ctrl_access.d" -MT"src/ASF/common/services/storage/ctrl_access/ctrl_access.o"   -o "src/ASF/common/services/storage/ctrl_access/ctrl_access.o" "../src/ASF/common/services/storage/ctrl_access/ctrl_access.c" 
		Finished building: ../src/ASF/common/services/storage/ctrl_access/ctrl_access.c
		Building file: ../src/ASF/common/services/usb/class/msc/device/udi_msc.c
		Invoking: ARM/GNU C Compiler : 6.3.1
		"C:\Program Files (x86)\Atmel\Studio\7.0\toolchain\arm\arm-gnu-toolchain\bin\arm-none-eabi-gcc.exe"  -x c -mthumb -D__SAME70Q21__ -DDEBUG -DBOARD=SAME70_XPLAINED -DVIRTUAL_MEMORY_ENABLE -DARM_MATH_CM7=true -Dprintf=iprintf -DUDD_ENABLE -D__SAME70Q21__ -Dscanf=iscanf -DACCESS_USB_ENABLED  -I"../src/ASF/common/components/memory/virtual_mem" -I"../src/ASF/common/services/storage/ctrl_access" -I"../src" -I"../src/ASF/common/services/clock" -I"../src/ASF/sam/drivers/pmc" -I"../src/ASF/sam/utils" -I"../src/ASF/sam/utils/header_files" -I"../src/ASF/sam/utils/preprocessor" -I"../src/ASF/thirdparty/CMSIS/Include" -I"../src/ASF/thirdparty/CMSIS/Lib/GCC" -I"../src/ASF/sam/utils/fpu" -I"../src/ASF/common/utils" -I"../src/ASF/sam/utils/cmsis/same70/include" -I"../src/ASF/sam/utils/cmsis/same70/source/templates" -I"../src/ASF/common/services/sleepmgr" -I"../src/ASF/common/services/usb/class/msc/device" -I"../src/ASF/common/services/usb/class/msc" -I"../src/ASF/common/services/usb/udc" -I"../src/ASF/sam/drivers/usbhs" -I"../src/ASF/common/services/ioport" -I"../src/ASF/sam/drivers/pio" -I"../src/ASF/common/services/usb" -I"../src/ASF/sam/boards/same70_xplained" -I"../src/ASF/sam/boards" -I"../src/ASF/common/boards" -I"../src/ASF/common/services/gpio" -I"../src/ASF/sam/drivers/mpu" -I"../src/config"  -O1 -fdata-sections -ffunction-sections -mlong-calls -g3 -Wall -mcpu=cortex-m7 -c -pipe -fno-strict-aliasing -Wall -Wstrict-prototypes -Wmissing-prototypes -Werror-implicit-function-declaration -Wpointer-arith -std=gnu99 -ffunction-sections -fdata-sections -Wchar-subscripts -Wcomment -Wformat=2 -Wimplicit-int -Wmain -Wparentheses -Wsequence-point -Wreturn-type -Wswitch -Wtrigraphs -Wunused -Wuninitialized -Wunknown-pragmas -Wfloat-equal -Wundef -Wshadow -Wbad-function-cast -Wwrite-strings -Wsign-compare -Waggregate-return -Wmissing-declarations -Wformat -Wmissing-format-attribute -Wno-deprecated-declarations -Wpacked -Wredundant-decls -Wnested-externs -Wlong-long -Wunreachable-code -Wcast-align --param max-inline-insns-single=500 -mfloat-abi=softfp -mfpu=fpv5-sp-d16 -MD -MP -MF "src/ASF/common/services/usb/class/msc/device/udi_msc.d" -MT"src/ASF/common/services/usb/class/msc/device/udi_msc.d" -MT"src/ASF/common/services/usb/class/msc/device/udi_msc.o"   -o "src/ASF/common/services/usb/class/msc/device/udi_msc.o" "../src/ASF/common/services/usb/class/msc/device/udi_msc.c" 
		Finished building: ../src/ASF/common/services/usb/class/msc/device/udi_msc.c
		Building file: ../src/ASF/common/services/usb/udc/udc.c
		Invoking: ARM/GNU C Compiler : 6.3.1
		"C:\Program Files (x86)\Atmel\Studio\7.0\toolchain\arm\arm-gnu-toolchain\bin\arm-none-eabi-gcc.exe"  -x c -mthumb -D__SAME70Q21__ -DDEBUG -DBOARD=SAME70_XPLAINED -DVIRTUAL_MEMORY_ENABLE -DARM_MATH_CM7=true -Dprintf=iprintf -DUDD_ENABLE -D__SAME70Q21__ -Dscanf=iscanf -DACCESS_USB_ENABLED  -I"../src/ASF/common/components/memory/virtual_mem" -I"../src/ASF/common/services/storage/ctrl_access" -I"../src" -I"../src/ASF/common/services/clock" -I"../src/ASF/sam/drivers/pmc" -I"../src/ASF/sam/utils" -I"../src/ASF/sam/utils/header_files" -I"../src/ASF/sam/utils/preprocessor" -I"../src/ASF/thirdparty/CMSIS/Include" -I"../src/ASF/thirdparty/CMSIS/Lib/GCC" -I"../src/ASF/sam/utils/fpu" -I"../src/ASF/common/utils" -I"../src/ASF/sam/utils/cmsis/same70/include" -I"../src/ASF/sam/utils/cmsis/same70/source/templates" -I"../src/ASF/common/services/sleepmgr" -I"../src/ASF/common/services/usb/class/msc/device" -I"../src/ASF/common/services/usb/class/msc" -I"../src/ASF/common/services/usb/udc" -I"../src/ASF/sam/drivers/usbhs" -I"../src/ASF/common/services/ioport" -I"../src/ASF/sam/drivers/pio" -I"../src/ASF/common/services/usb" -I"../src/ASF/sam/boards/same70_xplained" -I"../src/ASF/sam/boards" -I"../src/ASF/common/boards" -I"../src/ASF/common/services/gpio" -I"../src/ASF/sam/drivers/mpu" -I"../src/config"  -O1 -fdata-sections -ffunction-sections -mlong-calls -g3 -Wall -mcpu=cortex-m7 -c -pipe -fno-strict-aliasing -Wall -Wstrict-prototypes -Wmissing-prototypes -Werror-implicit-function-declaration -Wpointer-arith -std=gnu99 -ffunction-sections -fdata-sections -Wchar-subscripts -Wcomment -Wformat=2 -Wimplicit-int -Wmain -Wparentheses -Wsequence-point -Wreturn-type -Wswitch -Wtrigraphs -Wunused -Wuninitialized -Wunknown-pragmas -Wfloat-equal -Wundef -Wshadow -Wbad-function-cast -Wwrite-strings -Wsign-compare -Waggregate-return -Wmissing-declarations -Wformat -Wmissing-format-attribute -Wno-deprecated-declarations -Wpacked -Wredundant-decls -Wnested-externs -Wlong-long -Wunreachable-code -Wcast-align --param max-inline-insns-single=500 -mfloat-abi=softfp -mfpu=fpv5-sp-d16 -MD -MP -MF "src/ASF/common/services/usb/udc/udc.d" -MT"src/ASF/common/services/usb/udc/udc.d" -MT"src/ASF/common/services/usb/udc/udc.o"   -o "src/ASF/common/services/usb/udc/udc.o" "../src/ASF/common/services/usb/udc/udc.c" 
		Finished building: ../src/ASF/common/services/usb/udc/udc.c
		Building file: ../src/ASF/common/utils/interrupt/interrupt_sam_nvic.c
		Invoking: ARM/GNU C Compiler : 6.3.1
		"C:\Program Files (x86)\Atmel\Studio\7.0\toolchain\arm\arm-gnu-toolchain\bin\arm-none-eabi-gcc.exe"  -x c -mthumb -D__SAME70Q21__ -DDEBUG -DBOARD=SAME70_XPLAINED -DVIRTUAL_MEMORY_ENABLE -DARM_MATH_CM7=true -Dprintf=iprintf -DUDD_ENABLE -D__SAME70Q21__ -Dscanf=iscanf -DACCESS_USB_ENABLED  -I"../src/ASF/common/components/memory/virtual_mem" -I"../src/ASF/common/services/storage/ctrl_access" -I"../src" -I"../src/ASF/common/services/clock" -I"../src/ASF/sam/drivers/pmc" -I"../src/ASF/sam/utils" -I"../src/ASF/sam/utils/header_files" -I"../src/ASF/sam/utils/preprocessor" -I"../src/ASF/thirdparty/CMSIS/Include" -I"../src/ASF/thirdparty/CMSIS/Lib/GCC" -I"../src/ASF/sam/utils/fpu" -I"../src/ASF/common/utils" -I"../src/ASF/sam/utils/cmsis/same70/include" -I"../src/ASF/sam/utils/cmsis/same70/source/templates" -I"../src/ASF/common/services/sleepmgr" -I"../src/ASF/common/services/usb/class/msc/device" -I"../src/ASF/common/services/usb/class/msc" -I"../src/ASF/common/services/usb/udc" -I"../src/ASF/sam/drivers/usbhs" -I"../src/ASF/common/services/ioport" -I"../src/ASF/sam/drivers/pio" -I"../src/ASF/common/services/usb" -I"../src/ASF/sam/boards/same70_xplained" -I"../src/ASF/sam/boards" -I"../src/ASF/common/boards" -I"../src/ASF/common/services/gpio" -I"../src/ASF/sam/drivers/mpu" -I"../src/config"  -O1 -fdata-sections -ffunction-sections -mlong-calls -g3 -Wall -mcpu=cortex-m7 -c -pipe -fno-strict-aliasing -Wall -Wstrict-prototypes -Wmissing-prototypes -Werror-implicit-function-declaration -Wpointer-arith -std=gnu99 -ffunction-sections -fdata-sections -Wchar-subscripts -Wcomment -Wformat=2 -Wimplicit-int -Wmain -Wparentheses -Wsequence-point -Wreturn-type -Wswitch -Wtrigraphs -Wunused -Wuninitialized -Wunknown-pragmas -Wfloat-equal -Wundef -Wshadow -Wbad-function-cast -Wwrite-strings -Wsign-compare -Waggregate-return -Wmissing-declarations -Wformat -Wmissing-format-attribute -Wno-deprecated-declarations -Wpacked -Wredundant-decls -Wnested-externs -Wlong-long -Wunreachable-code -Wcast-align --param max-inline-insns-single=500 -mfloat-abi=softfp -mfpu=fpv5-sp-d16 -MD -MP -MF "src/ASF/common/utils/interrupt/interrupt_sam_nvic.d" -MT"src/ASF/common/utils/interrupt/interrupt_sam_nvic.d" -MT"src/ASF/common/utils/interrupt/interrupt_sam_nvic.o"   -o "src/ASF/common/utils/interrupt/interrupt_sam_nvic.o" "../src/ASF/common/utils/interrupt/interrupt_sam_nvic.c" 
		Finished building: ../src/ASF/common/utils/interrupt/interrupt_sam_nvic.c
		Building file: ../src/ASF/sam/boards/same70_xplained/init.c
		Invoking: ARM/GNU C Compiler : 6.3.1
		"C:\Program Files (x86)\Atmel\Studio\7.0\toolchain\arm\arm-gnu-toolchain\bin\arm-none-eabi-gcc.exe"  -x c -mthumb -D__SAME70Q21__ -DDEBUG -DBOARD=SAME70_XPLAINED -DVIRTUAL_MEMORY_ENABLE -DARM_MATH_CM7=true -Dprintf=iprintf -DUDD_ENABLE -D__SAME70Q21__ -Dscanf=iscanf -DACCESS_USB_ENABLED  -I"../src/ASF/common/components/memory/virtual_mem" -I"../src/ASF/common/services/storage/ctrl_access" -I"../src" -I"../src/ASF/common/services/clock" -I"../src/ASF/sam/drivers/pmc" -I"../src/ASF/sam/utils" -I"../src/ASF/sam/utils/header_files" -I"../src/ASF/sam/utils/preprocessor" -I"../src/ASF/thirdparty/CMSIS/Include" -I"../src/ASF/thirdparty/CMSIS/Lib/GCC" -I"../src/ASF/sam/utils/fpu" -I"../src/ASF/common/utils" -I"../src/ASF/sam/utils/cmsis/same70/include" -I"../src/ASF/sam/utils/cmsis/same70/source/templates" -I"../src/ASF/common/services/sleepmgr" -I"../src/ASF/common/services/usb/class/msc/device" -I"../src/ASF/common/services/usb/class/msc" -I"../src/ASF/common/services/usb/udc" -I"../src/ASF/sam/drivers/usbhs" -I"../src/ASF/common/services/ioport" -I"../src/ASF/sam/drivers/pio" -I"../src/ASF/common/services/usb" -I"../src/ASF/sam/boards/same70_xplained" -I"../src/ASF/sam/boards" -I"../src/ASF/common/boards" -I"../src/ASF/common/services/gpio" -I"../src/ASF/sam/drivers/mpu" -I"../src/config"  -O1 -fdata-sections -ffunction-sections -mlong-calls -g3 -Wall -mcpu=cortex-m7 -c -pipe -fno-strict-aliasing -Wall -Wstrict-prototypes -Wmissing-prototypes -Werror-implicit-function-declaration -Wpointer-arith -std=gnu99 -ffunction-sections -fdata-sections -Wchar-subscripts -Wcomment -Wformat=2 -Wimplicit-int -Wmain -Wparentheses -Wsequence-point -Wreturn-type -Wswitch -Wtrigraphs -Wunused -Wuninitialized -Wunknown-pragmas -Wfloat-equal -Wundef -Wshadow -Wbad-function-cast -Wwrite-strings -Wsign-compare -Waggregate-return -Wmissing-declarations -Wformat -Wmissing-format-attribute -Wno-deprecated-declarations -Wpacked -Wredundant-decls -Wnested-externs -Wlong-long -Wunreachable-code -Wcast-align --param max-inline-insns-single=500 -mfloat-abi=softfp -mfpu=fpv5-sp-d16 -MD -MP -MF "src/ASF/sam/boards/same70_xplained/init.d" -MT"src/ASF/sam/boards/same70_xplained/init.d" -MT"src/ASF/sam/boards/same70_xplained/init.o"   -o "src/ASF/sam/boards/same70_xplained/init.o" "../src/ASF/sam/boards/same70_xplained/init.c" 
		Finished building: ../src/ASF/sam/boards/same70_xplained/init.c
		Building file: ../src/ASF/sam/drivers/mpu/mpu.c
		Invoking: ARM/GNU C Compiler : 6.3.1
		"C:\Program Files (x86)\Atmel\Studio\7.0\toolchain\arm\arm-gnu-toolchain\bin\arm-none-eabi-gcc.exe"  -x c -mthumb -D__SAME70Q21__ -DDEBUG -DBOARD=SAME70_XPLAINED -DVIRTUAL_MEMORY_ENABLE -DARM_MATH_CM7=true -Dprintf=iprintf -DUDD_ENABLE -D__SAME70Q21__ -Dscanf=iscanf -DACCESS_USB_ENABLED  -I"../src/ASF/common/components/memory/virtual_mem" -I"../src/ASF/common/services/storage/ctrl_access" -I"../src" -I"../src/ASF/common/services/clock" -I"../src/ASF/sam/drivers/pmc" -I"../src/ASF/sam/utils" -I"../src/ASF/sam/utils/header_files" -I"../src/ASF/sam/utils/preprocessor" -I"../src/ASF/thirdparty/CMSIS/Include" -I"../src/ASF/thirdparty/CMSIS/Lib/GCC" -I"../src/ASF/sam/utils/fpu" -I"../src/ASF/common/utils" -I"../src/ASF/sam/utils/cmsis/same70/include" -I"../src/ASF/sam/utils/cmsis/same70/source/templates" -I"../src/ASF/common/services/sleepmgr" -I"../src/ASF/common/services/usb/class/msc/device" -I"../src/ASF/common/services/usb/class/msc" -I"../src/ASF/common/services/usb/udc" -I"../src/ASF/sam/drivers/usbhs" -I"../src/ASF/common/services/ioport" -I"../src/ASF/sam/drivers/pio" -I"../src/ASF/common/services/usb" -I"../src/ASF/sam/boards/same70_xplained" -I"../src/ASF/sam/boards" -I"../src/ASF/common/boards" -I"../src/ASF/common/services/gpio" -I"../src/ASF/sam/drivers/mpu" -I"../src/config"  -O1 -fdata-sections -ffunction-sections -mlong-calls -g3 -Wall -mcpu=cortex-m7 -c -pipe -fno-strict-aliasing -Wall -Wstrict-prototypes -Wmissing-prototypes -Werror-implicit-function-declaration -Wpointer-arith -std=gnu99 -ffunction-sections -fdata-sections -Wchar-subscripts -Wcomment -Wformat=2 -Wimplicit-int -Wmain -Wparentheses -Wsequence-point -Wreturn-type -Wswitch -Wtrigraphs -Wunused -Wuninitialized -Wunknown-pragmas -Wfloat-equal -Wundef -Wshadow -Wbad-function-cast -Wwrite-strings -Wsign-compare -Waggregate-return -Wmissing-declarations -Wformat -Wmissing-format-attribute -Wno-deprecated-declarations -Wpacked -Wredundant-decls -Wnested-externs -Wlong-long -Wunreachable-code -Wcast-align --param max-inline-insns-single=500 -mfloat-abi=softfp -mfpu=fpv5-sp-d16 -MD -MP -MF "src/ASF/sam/drivers/mpu/mpu.d" -MT"src/ASF/sam/drivers/mpu/mpu.d" -MT"src/ASF/sam/drivers/mpu/mpu.o"   -o "src/ASF/sam/drivers/mpu/mpu.o" "../src/ASF/sam/drivers/mpu/mpu.c" 
		Finished building: ../src/ASF/sam/drivers/mpu/mpu.c
		Building file: ../src/ASF/sam/drivers/pio/pio.c
		Invoking: ARM/GNU C Compiler : 6.3.1
		"C:\Program Files (x86)\Atmel\Studio\7.0\toolchain\arm\arm-gnu-toolchain\bin\arm-none-eabi-gcc.exe"  -x c -mthumb -D__SAME70Q21__ -DDEBUG -DBOARD=SAME70_XPLAINED -DVIRTUAL_MEMORY_ENABLE -DARM_MATH_CM7=true -Dprintf=iprintf -DUDD_ENABLE -D__SAME70Q21__ -Dscanf=iscanf -DACCESS_USB_ENABLED  -I"../src/ASF/common/components/memory/virtual_mem" -I"../src/ASF/common/services/storage/ctrl_access" -I"../src" -I"../src/ASF/common/services/clock" -I"../src/ASF/sam/drivers/pmc" -I"../src/ASF/sam/utils" -I"../src/ASF/sam/utils/header_files" -I"../src/ASF/sam/utils/preprocessor" -I"../src/ASF/thirdparty/CMSIS/Include" -I"../src/ASF/thirdparty/CMSIS/Lib/GCC" -I"../src/ASF/sam/utils/fpu" -I"../src/ASF/common/utils" -I"../src/ASF/sam/utils/cmsis/same70/include" -I"../src/ASF/sam/utils/cmsis/same70/source/templates" -I"../src/ASF/common/services/sleepmgr" -I"../src/ASF/common/services/usb/class/msc/device" -I"../src/ASF/common/services/usb/class/msc" -I"../src/ASF/common/services/usb/udc" -I"../src/ASF/sam/drivers/usbhs" -I"../src/ASF/common/services/ioport" -I"../src/ASF/sam/drivers/pio" -I"../src/ASF/common/services/usb" -I"../src/ASF/sam/boards/same70_xplained" -I"../src/ASF/sam/boards" -I"../src/ASF/common/boards" -I"../src/ASF/common/services/gpio" -I"../src/ASF/sam/drivers/mpu" -I"../src/config"  -O1 -fdata-sections -ffunction-sections -mlong-calls -g3 -Wall -mcpu=cortex-m7 -c -pipe -fno-strict-aliasing -Wall -Wstrict-prototypes -Wmissing-prototypes -Werror-implicit-function-declaration -Wpointer-arith -std=gnu99 -ffunction-sections -fdata-sections -Wchar-subscripts -Wcomment -Wformat=2 -Wimplicit-int -Wmain -Wparentheses -Wsequence-point -Wreturn-type -Wswitch -Wtrigraphs -Wunused -Wuninitialized -Wunknown-pragmas -Wfloat-equal -Wundef -Wshadow -Wbad-function-cast -Wwrite-strings -Wsign-compare -Waggregate-return -Wmissing-declarations -Wformat -Wmissing-format-attribute -Wno-deprecated-declarations -Wpacked -Wredundant-decls -Wnested-externs -Wlong-long -Wunreachable-code -Wcast-align --param max-inline-insns-single=500 -mfloat-abi=softfp -mfpu=fpv5-sp-d16 -MD -MP -MF "src/ASF/sam/drivers/pio/pio.d" -MT"src/ASF/sam/drivers/pio/pio.d" -MT"src/ASF/sam/drivers/pio/pio.o"   -o "src/ASF/sam/drivers/pio/pio.o" "../src/ASF/sam/drivers/pio/pio.c" 
		Finished building: ../src/ASF/sam/drivers/pio/pio.c
		Building file: ../src/ASF/sam/drivers/pio/pio_handler.c
		Invoking: ARM/GNU C Compiler : 6.3.1
		"C:\Program Files (x86)\Atmel\Studio\7.0\toolchain\arm\arm-gnu-toolchain\bin\arm-none-eabi-gcc.exe"  -x c -mthumb -D__SAME70Q21__ -DDEBUG -DBOARD=SAME70_XPLAINED -DVIRTUAL_MEMORY_ENABLE -DARM_MATH_CM7=true -Dprintf=iprintf -DUDD_ENABLE -D__SAME70Q21__ -Dscanf=iscanf -DACCESS_USB_ENABLED  -I"../src/ASF/common/components/memory/virtual_mem" -I"../src/ASF/common/services/storage/ctrl_access" -I"../src" -I"../src/ASF/common/services/clock" -I"../src/ASF/sam/drivers/pmc" -I"../src/ASF/sam/utils" -I"../src/ASF/sam/utils/header_files" -I"../src/ASF/sam/utils/preprocessor" -I"../src/ASF/thirdparty/CMSIS/Include" -I"../src/ASF/thirdparty/CMSIS/Lib/GCC" -I"../src/ASF/sam/utils/fpu" -I"../src/ASF/common/utils" -I"../src/ASF/sam/utils/cmsis/same70/include" -I"../src/ASF/sam/utils/cmsis/same70/source/templates" -I"../src/ASF/common/services/sleepmgr" -I"../src/ASF/common/services/usb/class/msc/device" -I"../src/ASF/common/services/usb/class/msc" -I"../src/ASF/common/services/usb/udc" -I"../src/ASF/sam/drivers/usbhs" -I"../src/ASF/common/services/ioport" -I"../src/ASF/sam/drivers/pio" -I"../src/ASF/common/services/usb" -I"../src/ASF/sam/boards/same70_xplained" -I"../src/ASF/sam/boards" -I"../src/ASF/common/boards" -I"../src/ASF/common/services/gpio" -I"../src/ASF/sam/drivers/mpu" -I"../src/config"  -O1 -fdata-sections -ffunction-sections -mlong-calls -g3 -Wall -mcpu=cortex-m7 -c -pipe -fno-strict-aliasing -Wall -Wstrict-prototypes -Wmissing-prototypes -Werror-implicit-function-declaration -Wpointer-arith -std=gnu99 -ffunction-sections -fdata-sections -Wchar-subscripts -Wcomment -Wformat=2 -Wimplicit-int -Wmain -Wparentheses -Wsequence-point -Wreturn-type -Wswitch -Wtrigraphs -Wunused -Wuninitialized -Wunknown-pragmas -Wfloat-equal -Wundef -Wshadow -Wbad-function-cast -Wwrite-strings -Wsign-compare -Waggregate-return -Wmissing-declarations -Wformat -Wmissing-format-attribute -Wno-deprecated-declarations -Wpacked -Wredundant-decls -Wnested-externs -Wlong-long -Wunreachable-code -Wcast-align --param max-inline-insns-single=500 -mfloat-abi=softfp -mfpu=fpv5-sp-d16 -MD -MP -MF "src/ASF/sam/drivers/pio/pio_handler.d" -MT"src/ASF/sam/drivers/pio/pio_handler.d" -MT"src/ASF/sam/drivers/pio/pio_handler.o"   -o "src/ASF/sam/drivers/pio/pio_handler.o" "../src/ASF/sam/drivers/pio/pio_handler.c" 
		Finished building: ../src/ASF/sam/drivers/pio/pio_handler.c
		Building file: ../src/ASF/sam/drivers/pmc/sleep.c
		Invoking: ARM/GNU C Compiler : 6.3.1
		"C:\Program Files (x86)\Atmel\Studio\7.0\toolchain\arm\arm-gnu-toolchain\bin\arm-none-eabi-gcc.exe"  -x c -mthumb -D__SAME70Q21__ -DDEBUG -DBOARD=SAME70_XPLAINED -DVIRTUAL_MEMORY_ENABLE -DARM_MATH_CM7=true -Dprintf=iprintf -DUDD_ENABLE -D__SAME70Q21__ -Dscanf=iscanf -DACCESS_USB_ENABLED  -I"../src/ASF/common/components/memory/virtual_mem" -I"../src/ASF/common/services/storage/ctrl_access" -I"../src" -I"../src/ASF/common/services/clock" -I"../src/ASF/sam/drivers/pmc" -I"../src/ASF/sam/utils" -I"../src/ASF/sam/utils/header_files" -I"../src/ASF/sam/utils/preprocessor" -I"../src/ASF/thirdparty/CMSIS/Include" -I"../src/ASF/thirdparty/CMSIS/Lib/GCC" -I"../src/ASF/sam/utils/fpu" -I"../src/ASF/common/utils" -I"../src/ASF/sam/utils/cmsis/same70/include" -I"../src/ASF/sam/utils/cmsis/same70/source/templates" -I"../src/ASF/common/services/sleepmgr" -I"../src/ASF/common/services/usb/class/msc/device" -I"../src/ASF/common/services/usb/class/msc" -I"../src/ASF/common/services/usb/udc" -I"../src/ASF/sam/drivers/usbhs" -I"../src/ASF/common/services/ioport" -I"../src/ASF/sam/drivers/pio" -I"../src/ASF/common/services/usb" -I"../src/ASF/sam/boards/same70_xplained" -I"../src/ASF/sam/boards" -I"../src/ASF/common/boards" -I"../src/ASF/common/services/gpio" -I"../src/ASF/sam/drivers/mpu" -I"../src/config"  -O1 -fdata-sections -ffunction-sections -mlong-calls -g3 -Wall -mcpu=cortex-m7 -c -pipe -fno-strict-aliasing -Wall -Wstrict-prototypes -Wmissing-prototypes -Werror-implicit-function-declaration -Wpointer-arith -std=gnu99 -ffunction-sections -fdata-sections -Wchar-subscripts -Wcomment -Wformat=2 -Wimplicit-int -Wmain -Wparentheses -Wsequence-point -Wreturn-type -Wswitch -Wtrigraphs -Wunused -Wuninitialized -Wunknown-pragmas -Wfloat-equal -Wundef -Wshadow -Wbad-function-cast -Wwrite-strings -Wsign-compare -Waggregate-return -Wmissing-declarations -Wformat -Wmissing-format-attribute -Wno-deprecated-declarations -Wpacked -Wredundant-decls -Wnested-externs -Wlong-long -Wunreachable-code -Wcast-align --param max-inline-insns-single=500 -mfloat-abi=softfp -mfpu=fpv5-sp-d16 -MD -MP -MF "src/ASF/sam/drivers/pmc/sleep.d" -MT"src/ASF/sam/drivers/pmc/sleep.d" -MT"src/ASF/sam/drivers/pmc/sleep.o"   -o "src/ASF/sam/drivers/pmc/sleep.o" "../src/ASF/sam/drivers/pmc/sleep.c" 
		Finished building: ../src/ASF/sam/drivers/pmc/sleep.c
		Building file: ../src/ASF/sam/drivers/pmc/pmc.c
		Invoking: ARM/GNU C Compiler : 6.3.1
		"C:\Program Files (x86)\Atmel\Studio\7.0\toolchain\arm\arm-gnu-toolchain\bin\arm-none-eabi-gcc.exe"  -x c -mthumb -D__SAME70Q21__ -DDEBUG -DBOARD=SAME70_XPLAINED -DVIRTUAL_MEMORY_ENABLE -DARM_MATH_CM7=true -Dprintf=iprintf -DUDD_ENABLE -D__SAME70Q21__ -Dscanf=iscanf -DACCESS_USB_ENABLED  -I"../src/ASF/common/components/memory/virtual_mem" -I"../src/ASF/common/services/storage/ctrl_access" -I"../src" -I"../src/ASF/common/services/clock" -I"../src/ASF/sam/drivers/pmc" -I"../src/ASF/sam/utils" -I"../src/ASF/sam/utils/header_files" -I"../src/ASF/sam/utils/preprocessor" -I"../src/ASF/thirdparty/CMSIS/Include" -I"../src/ASF/thirdparty/CMSIS/Lib/GCC" -I"../src/ASF/sam/utils/fpu" -I"../src/ASF/common/utils" -I"../src/ASF/sam/utils/cmsis/same70/include" -I"../src/ASF/sam/utils/cmsis/same70/source/templates" -I"../src/ASF/common/services/sleepmgr" -I"../src/ASF/common/services/usb/class/msc/device" -I"../src/ASF/common/services/usb/class/msc" -I"../src/ASF/common/services/usb/udc" -I"../src/ASF/sam/drivers/usbhs" -I"../src/ASF/common/services/ioport" -I"../src/ASF/sam/drivers/pio" -I"../src/ASF/common/services/usb" -I"../src/ASF/sam/boards/same70_xplained" -I"../src/ASF/sam/boards" -I"../src/ASF/common/boards" -I"../src/ASF/common/services/gpio" -I"../src/ASF/sam/drivers/mpu" -I"../src/config"  -O1 -fdata-sections -ffunction-sections -mlong-calls -g3 -Wall -mcpu=cortex-m7 -c -pipe -fno-strict-aliasing -Wall -Wstrict-prototypes -Wmissing-prototypes -Werror-implicit-function-declaration -Wpointer-arith -std=gnu99 -ffunction-sections -fdata-sections -Wchar-subscripts -Wcomment -Wformat=2 -Wimplicit-int -Wmain -Wparentheses -Wsequence-point -Wreturn-type -Wswitch -Wtrigraphs -Wunused -Wuninitialized -Wunknown-pragmas -Wfloat-equal -Wundef -Wshadow -Wbad-function-cast -Wwrite-strings -Wsign-compare -Waggregate-return -Wmissing-declarations -Wformat -Wmissing-format-attribute -Wno-deprecated-declarations -Wpacked -Wredundant-decls -Wnested-externs -Wlong-long -Wunreachable-code -Wcast-align --param max-inline-insns-single=500 -mfloat-abi=softfp -mfpu=fpv5-sp-d16 -MD -MP -MF "src/ASF/sam/drivers/pmc/pmc.d" -MT"src/ASF/sam/drivers/pmc/pmc.d" -MT"src/ASF/sam/drivers/pmc/pmc.o"   -o "src/ASF/sam/drivers/pmc/pmc.o" "../src/ASF/sam/drivers/pmc/pmc.c" 
		Finished building: ../src/ASF/sam/drivers/pmc/pmc.c
		Building file: ../src/ASF/sam/utils/syscalls/gcc/syscalls.c
		Invoking: ARM/GNU C Compiler : 6.3.1
		"C:\Program Files (x86)\Atmel\Studio\7.0\toolchain\arm\arm-gnu-toolchain\bin\arm-none-eabi-gcc.exe"  -x c -mthumb -D__SAME70Q21__ -DDEBUG -DBOARD=SAME70_XPLAINED -DVIRTUAL_MEMORY_ENABLE -DARM_MATH_CM7=true -Dprintf=iprintf -DUDD_ENABLE -D__SAME70Q21__ -Dscanf=iscanf -DACCESS_USB_ENABLED  -I"../src/ASF/common/components/memory/virtual_mem" -I"../src/ASF/common/services/storage/ctrl_access" -I"../src" -I"../src/ASF/common/services/clock" -I"../src/ASF/sam/drivers/pmc" -I"../src/ASF/sam/utils" -I"../src/ASF/sam/utils/header_files" -I"../src/ASF/sam/utils/preprocessor" -I"../src/ASF/thirdparty/CMSIS/Include" -I"../src/ASF/thirdparty/CMSIS/Lib/GCC" -I"../src/ASF/sam/utils/fpu" -I"../src/ASF/common/utils" -I"../src/ASF/sam/utils/cmsis/same70/include" -I"../src/ASF/sam/utils/cmsis/same70/source/templates" -I"../src/ASF/common/services/sleepmgr" -I"../src/ASF/common/services/usb/class/msc/device" -I"../src/ASF/common/services/usb/class/msc" -I"../src/ASF/common/services/usb/udc" -I"../src/ASF/sam/drivers/usbhs" -I"../src/ASF/common/services/ioport" -I"../src/ASF/sam/drivers/pio" -I"../src/ASF/common/services/usb" -I"../src/ASF/sam/boards/same70_xplained" -I"../src/ASF/sam/boards" -I"../src/ASF/common/boards" -I"../src/ASF/common/services/gpio" -I"../src/ASF/sam/drivers/mpu" -I"../src/config"  -O1 -fdata-sections -ffunction-sections -mlong-calls -g3 -Wall -mcpu=cortex-m7 -c -pipe -fno-strict-aliasing -Wall -Wstrict-prototypes -Wmissing-prototypes -Werror-implicit-function-declaration -Wpointer-arith -std=gnu99 -ffunction-sections -fdata-sections -Wchar-subscripts -Wcomment -Wformat=2 -Wimplicit-int -Wmain -Wparentheses -Wsequence-point -Wreturn-type -Wswitch -Wtrigraphs -Wunused -Wuninitialized -Wunknown-pragmas -Wfloat-equal -Wundef -Wshadow -Wbad-function-cast -Wwrite-strings -Wsign-compare -Waggregate-return -Wmissing-declarations -Wformat -Wmissing-format-attribute -Wno-deprecated-declarations -Wpacked -Wredundant-decls -Wnested-externs -Wlong-long -Wunreachable-code -Wcast-align --param max-inline-insns-single=500 -mfloat-abi=softfp -mfpu=fpv5-sp-d16 -MD -MP -MF "src/ASF/sam/utils/syscalls/gcc/syscalls.d" -MT"src/ASF/sam/utils/syscalls/gcc/syscalls.d" -MT"src/ASF/sam/utils/syscalls/gcc/syscalls.o"   -o "src/ASF/sam/utils/syscalls/gcc/syscalls.o" "../src/ASF/sam/utils/syscalls/gcc/syscalls.c" 
		Finished building: ../src/ASF/sam/utils/syscalls/gcc/syscalls.c
		Building file: ../src/ASF/sam/utils/cmsis/same70/source/templates/gcc/startup_same70.c
		Invoking: ARM/GNU C Compiler : 6.3.1
		"C:\Program Files (x86)\Atmel\Studio\7.0\toolchain\arm\arm-gnu-toolchain\bin\arm-none-eabi-gcc.exe"  -x c -mthumb -D__SAME70Q21__ -DDEBUG -DBOARD=SAME70_XPLAINED -DVIRTUAL_MEMORY_ENABLE -DARM_MATH_CM7=true -Dprintf=iprintf -DUDD_ENABLE -D__SAME70Q21__ -Dscanf=iscanf -DACCESS_USB_ENABLED  -I"../src/ASF/common/components/memory/virtual_mem" -I"../src/ASF/common/services/storage/ctrl_access" -I"../src" -I"../src/ASF/common/services/clock" -I"../src/ASF/sam/drivers/pmc" -I"../src/ASF/sam/utils" -I"../src/ASF/sam/utils/header_files" -I"../src/ASF/sam/utils/preprocessor" -I"../src/ASF/thirdparty/CMSIS/Include" -I"../src/ASF/thirdparty/CMSIS/Lib/GCC" -I"../src/ASF/sam/utils/fpu" -I"../src/ASF/common/utils" -I"../src/ASF/sam/utils/cmsis/same70/include" -I"../src/ASF/sam/utils/cmsis/same70/source/templates" -I"../src/ASF/common/services/sleepmgr" -I"../src/ASF/common/services/usb/class/msc/device" -I"../src/ASF/common/services/usb/class/msc" -I"../src/ASF/common/services/usb/udc" -I"../src/ASF/sam/drivers/usbhs" -I"../src/ASF/common/services/ioport" -I"../src/ASF/sam/drivers/pio" -I"../src/ASF/common/services/usb" -I"../src/ASF/sam/boards/same70_xplained" -I"../src/ASF/sam/boards" -I"../src/ASF/common/boards" -I"../src/ASF/common/services/gpio" -I"../src/ASF/sam/drivers/mpu" -I"../src/config"  -O1 -fdata-sections -ffunction-sections -mlong-calls -g3 -Wall -mcpu=cortex-m7 -c -pipe -fno-strict-aliasing -Wall -Wstrict-prototypes -Wmissing-prototypes -Werror-implicit-function-declaration -Wpointer-arith -std=gnu99 -ffunction-sections -fdata-sections -Wchar-subscripts -Wcomment -Wformat=2 -Wimplicit-int -Wmain -Wparentheses -Wsequence-point -Wreturn-type -Wswitch -Wtrigraphs -Wunused -Wuninitialized -Wunknown-pragmas -Wfloat-equal -Wundef -Wshadow -Wbad-function-cast -Wwrite-strings -Wsign-compare -Waggregate-return -Wmissing-declarations -Wformat -Wmissing-format-attribute -Wno-deprecated-declarations -Wpacked -Wredundant-decls -Wnested-externs -Wlong-long -Wunreachable-code -Wcast-align --param max-inline-insns-single=500 -mfloat-abi=softfp -mfpu=fpv5-sp-d16 -MD -MP -MF "src/ASF/sam/utils/cmsis/same70/source/templates/gcc/startup_same70.d" -MT"src/ASF/sam/utils/cmsis/same70/source/templates/gcc/startup_same70.d" -MT"src/ASF/sam/utils/cmsis/same70/source/templates/gcc/startup_same70.o"   -o "src/ASF/sam/utils/cmsis/same70/source/templates/gcc/startup_same70.o" "../src/ASF/sam/utils/cmsis/same70/source/templates/gcc/startup_same70.c" 
		Finished building: ../src/ASF/sam/utils/cmsis/same70/source/templates/gcc/startup_same70.c
		Building file: ../src/ASF/sam/utils/cmsis/same70/source/templates/system_same70.c
		Invoking: ARM/GNU C Compiler : 6.3.1
		"C:\Program Files (x86)\Atmel\Studio\7.0\toolchain\arm\arm-gnu-toolchain\bin\arm-none-eabi-gcc.exe"  -x c -mthumb -D__SAME70Q21__ -DDEBUG -DBOARD=SAME70_XPLAINED -DVIRTUAL_MEMORY_ENABLE -DARM_MATH_CM7=true -Dprintf=iprintf -DUDD_ENABLE -D__SAME70Q21__ -Dscanf=iscanf -DACCESS_USB_ENABLED  -I"../src/ASF/common/components/memory/virtual_mem" -I"../src/ASF/common/services/storage/ctrl_access" -I"../src" -I"../src/ASF/common/services/clock" -I"../src/ASF/sam/drivers/pmc" -I"../src/ASF/sam/utils" -I"../src/ASF/sam/utils/header_files" -I"../src/ASF/sam/utils/preprocessor" -I"../src/ASF/thirdparty/CMSIS/Include" -I"../src/ASF/thirdparty/CMSIS/Lib/GCC" -I"../src/ASF/sam/utils/fpu" -I"../src/ASF/common/utils" -I"../src/ASF/sam/utils/cmsis/same70/include" -I"../src/ASF/sam/utils/cmsis/same70/source/templates" -I"../src/ASF/common/services/sleepmgr" -I"../src/ASF/common/services/usb/class/msc/device" -I"../src/ASF/common/services/usb/class/msc" -I"../src/ASF/common/services/usb/udc" -I"../src/ASF/sam/drivers/usbhs" -I"../src/ASF/common/services/ioport" -I"../src/ASF/sam/drivers/pio" -I"../src/ASF/common/services/usb" -I"../src/ASF/sam/boards/same70_xplained" -I"../src/ASF/sam/boards" -I"../src/ASF/common/boards" -I"../src/ASF/common/services/gpio" -I"../src/ASF/sam/drivers/mpu" -I"../src/config"  -O1 -fdata-sections -ffunction-sections -mlong-calls -g3 -Wall -mcpu=cortex-m7 -c -pipe -fno-strict-aliasing -Wall -Wstrict-prototypes -Wmissing-prototypes -Werror-implicit-function-declaration -Wpointer-arith -std=gnu99 -ffunction-sections -fdata-sections -Wchar-subscripts -Wcomment -Wformat=2 -Wimplicit-int -Wmain -Wparentheses -Wsequence-point -Wreturn-type -Wswitch -Wtrigraphs -Wunused -Wuninitialized -Wunknown-pragmas -Wfloat-equal -Wundef -Wshadow -Wbad-function-cast -Wwrite-strings -Wsign-compare -Waggregate-return -Wmissing-declarations -Wformat -Wmissing-format-attribute -Wno-deprecated-declarations -Wpacked -Wredundant-decls -Wnested-externs -Wlong-long -Wunreachable-code -Wcast-align --param max-inline-insns-single=500 -mfloat-abi=softfp -mfpu=fpv5-sp-d16 -MD -MP -MF "src/ASF/sam/utils/cmsis/same70/source/templates/system_same70.d" -MT"src/ASF/sam/utils/cmsis/same70/source/templates/system_same70.d" -MT"src/ASF/sam/utils/cmsis/same70/source/templates/system_same70.o"   -o "src/ASF/sam/utils/cmsis/same70/source/templates/system_same70.o" "../src/ASF/sam/utils/cmsis/same70/source/templates/system_same70.c" 
		Finished building: ../src/ASF/sam/utils/cmsis/same70/source/templates/system_same70.c
		Building file: ../src/ASF/sam/drivers/usbhs/usbhs_device.c
		Invoking: ARM/GNU C Compiler : 6.3.1
		"C:\Program Files (x86)\Atmel\Studio\7.0\toolchain\arm\arm-gnu-toolchain\bin\arm-none-eabi-gcc.exe"  -x c -mthumb -D__SAME70Q21__ -DDEBUG -DBOARD=SAME70_XPLAINED -DVIRTUAL_MEMORY_ENABLE -DARM_MATH_CM7=true -Dprintf=iprintf -DUDD_ENABLE -D__SAME70Q21__ -Dscanf=iscanf -DACCESS_USB_ENABLED  -I"../src/ASF/common/components/memory/virtual_mem" -I"../src/ASF/common/services/storage/ctrl_access" -I"../src" -I"../src/ASF/common/services/clock" -I"../src/ASF/sam/drivers/pmc" -I"../src/ASF/sam/utils" -I"../src/ASF/sam/utils/header_files" -I"../src/ASF/sam/utils/preprocessor" -I"../src/ASF/thirdparty/CMSIS/Include" -I"../src/ASF/thirdparty/CMSIS/Lib/GCC" -I"../src/ASF/sam/utils/fpu" -I"../src/ASF/common/utils" -I"../src/ASF/sam/utils/cmsis/same70/include" -I"../src/ASF/sam/utils/cmsis/same70/source/templates" -I"../src/ASF/common/services/sleepmgr" -I"../src/ASF/common/services/usb/class/msc/device" -I"../src/ASF/common/services/usb/class/msc" -I"../src/ASF/common/services/usb/udc" -I"../src/ASF/sam/drivers/usbhs" -I"../src/ASF/common/services/ioport" -I"../src/ASF/sam/drivers/pio" -I"../src/ASF/common/services/usb" -I"../src/ASF/sam/boards/same70_xplained" -I"../src/ASF/sam/boards" -I"../src/ASF/common/boards" -I"../src/ASF/common/services/gpio" -I"../src/ASF/sam/drivers/mpu" -I"../src/config"  -O1 -fdata-sections -ffunction-sections -mlong-calls -g3 -Wall -mcpu=cortex-m7 -c -pipe -fno-strict-aliasing -Wall -Wstrict-prototypes -Wmissing-prototypes -Werror-implicit-function-declaration -Wpointer-arith -std=gnu99 -ffunction-sections -fdata-sections -Wchar-subscripts -Wcomment -Wformat=2 -Wimplicit-int -Wmain -Wparentheses -Wsequence-point -Wreturn-type -Wswitch -Wtrigraphs -Wunused -Wuninitialized -Wunknown-pragmas -Wfloat-equal -Wundef -Wshadow -Wbad-function-cast -Wwrite-strings -Wsign-compare -Waggregate-return -Wmissing-declarations -Wformat -Wmissing-format-attribute -Wno-deprecated-declarations -Wpacked -Wredundant-decls -Wnested-externs -Wlong-long -Wunreachable-code -Wcast-align --param max-inline-insns-single=500 -mfloat-abi=softfp -mfpu=fpv5-sp-d16 -MD -MP -MF "src/ASF/sam/drivers/usbhs/usbhs_device.d" -MT"src/ASF/sam/drivers/usbhs/usbhs_device.d" -MT"src/ASF/sam/drivers/usbhs/usbhs_device.o"   -o "src/ASF/sam/drivers/usbhs/usbhs_device.o" "../src/ASF/sam/drivers/usbhs/usbhs_device.c" 
		Finished building: ../src/ASF/sam/drivers/usbhs/usbhs_device.c
		Building file: ../src/main.c
		Invoking: ARM/GNU C Compiler : 6.3.1
		"C:\Program Files (x86)\Atmel\Studio\7.0\toolchain\arm\arm-gnu-toolchain\bin\arm-none-eabi-gcc.exe"  -x c -mthumb -D__SAME70Q21__ -DDEBUG -DBOARD=SAME70_XPLAINED -DVIRTUAL_MEMORY_ENABLE -DARM_MATH_CM7=true -Dprintf=iprintf -DUDD_ENABLE -D__SAME70Q21__ -Dscanf=iscanf -DACCESS_USB_ENABLED  -I"../src/ASF/common/components/memory/virtual_mem" -I"../src/ASF/common/services/storage/ctrl_access" -I"../src" -I"../src/ASF/common/services/clock" -I"../src/ASF/sam/drivers/pmc" -I"../src/ASF/sam/utils" -I"../src/ASF/sam/utils/header_files" -I"../src/ASF/sam/utils/preprocessor" -I"../src/ASF/thirdparty/CMSIS/Include" -I"../src/ASF/thirdparty/CMSIS/Lib/GCC" -I"../src/ASF/sam/utils/fpu" -I"../src/ASF/common/utils" -I"../src/ASF/sam/utils/cmsis/same70/include" -I"../src/ASF/sam/utils/cmsis/same70/source/templates" -I"../src/ASF/common/services/sleepmgr" -I"../src/ASF/common/services/usb/class/msc/device" -I"../src/ASF/common/services/usb/class/msc" -I"../src/ASF/common/services/usb/udc" -I"../src/ASF/sam/drivers/usbhs" -I"../src/ASF/common/services/ioport" -I"../src/ASF/sam/drivers/pio" -I"../src/ASF/common/services/usb" -I"../src/ASF/sam/boards/same70_xplained" -I"../src/ASF/sam/boards" -I"../src/ASF/common/boards" -I"../src/ASF/common/services/gpio" -I"../src/ASF/sam/drivers/mpu" -I"../src/config"  -O1 -fdata-sections -ffunction-sections -mlong-calls -g3 -Wall -mcpu=cortex-m7 -c -pipe -fno-strict-aliasing -Wall -Wstrict-prototypes -Wmissing-prototypes -Werror-implicit-function-declaration -Wpointer-arith -std=gnu99 -ffunction-sections -fdata-sections -Wchar-subscripts -Wcomment -Wformat=2 -Wimplicit-int -Wmain -Wparentheses -Wsequence-point -Wreturn-type -Wswitch -Wtrigraphs -Wunused -Wuninitialized -Wunknown-pragmas -Wfloat-equal -Wundef -Wshadow -Wbad-function-cast -Wwrite-strings -Wsign-compare -Waggregate-return -Wmissing-declarations -Wformat -Wmissing-format-attribute -Wno-deprecated-declarations -Wpacked -Wredundant-decls -Wnested-externs -Wlong-long -Wunreachable-code -Wcast-align --param max-inline-insns-single=500 -mfloat-abi=softfp -mfpu=fpv5-sp-d16 -MD -MP -MF "src/main.d" -MT"src/main.d" -MT"src/main.o"   -o "src/main.o" "../src/main.c" 
		Finished building: ../src/main.c
		Building file: ../src/memories_initialization_sam.c
		Invoking: ARM/GNU C Compiler : 6.3.1
		"C:\Program Files (x86)\Atmel\Studio\7.0\toolchain\arm\arm-gnu-toolchain\bin\arm-none-eabi-gcc.exe"  -x c -mthumb -D__SAME70Q21__ -DDEBUG -DBOARD=SAME70_XPLAINED -DVIRTUAL_MEMORY_ENABLE -DARM_MATH_CM7=true -Dprintf=iprintf -DUDD_ENABLE -D__SAME70Q21__ -Dscanf=iscanf -DACCESS_USB_ENABLED  -I"../src/ASF/common/components/memory/virtual_mem" -I"../src/ASF/common/services/storage/ctrl_access" -I"../src" -I"../src/ASF/common/services/clock" -I"../src/ASF/sam/drivers/pmc" -I"../src/ASF/sam/utils" -I"../src/ASF/sam/utils/header_files" -I"../src/ASF/sam/utils/preprocessor" -I"../src/ASF/thirdparty/CMSIS/Include" -I"../src/ASF/thirdparty/CMSIS/Lib/GCC" -I"../src/ASF/sam/utils/fpu" -I"../src/ASF/common/utils" -I"../src/ASF/sam/utils/cmsis/same70/include" -I"../src/ASF/sam/utils/cmsis/same70/source/templates" -I"../src/ASF/common/services/sleepmgr" -I"../src/ASF/common/services/usb/class/msc/device" -I"../src/ASF/common/services/usb/class/msc" -I"../src/ASF/common/services/usb/udc" -I"../src/ASF/sam/drivers/usbhs" -I"../src/ASF/common/services/ioport" -I"../src/ASF/sam/drivers/pio" -I"../src/ASF/common/services/usb" -I"../src/ASF/sam/boards/same70_xplained" -I"../src/ASF/sam/boards" -I"../src/ASF/common/boards" -I"../src/ASF/common/services/gpio" -I"../src/ASF/sam/drivers/mpu" -I"../src/config"  -O1 -fdata-sections -ffunction-sections -mlong-calls -g3 -Wall -mcpu=cortex-m7 -c -pipe -fno-strict-aliasing -Wall -Wstrict-prototypes -Wmissing-prototypes -Werror-implicit-function-declaration -Wpointer-arith -std=gnu99 -ffunction-sections -fdata-sections -Wchar-subscripts -Wcomment -Wformat=2 -Wimplicit-int -Wmain -Wparentheses -Wsequence-point -Wreturn-type -Wswitch -Wtrigraphs -Wunused -Wuninitialized -Wunknown-pragmas -Wfloat-equal -Wundef -Wshadow -Wbad-function-cast -Wwrite-strings -Wsign-compare -Waggregate-return -Wmissing-declarations -Wformat -Wmissing-format-attribute -Wno-deprecated-declarations -Wpacked -Wredundant-decls -Wnested-externs -Wlong-long -Wunreachable-code -Wcast-align --param max-inline-insns-single=500 -mfloat-abi=softfp -mfpu=fpv5-sp-d16 -MD -MP -MF "src/memories_initialization_sam.d" -MT"src/memories_initialization_sam.d" -MT"src/memories_initialization_sam.o"   -o "src/memories_initialization_sam.o" "../src/memories_initialization_sam.c" 
		Finished building: ../src/memories_initialization_sam.c
		Building target: SAME70_USB_MSC.elf
		Invoking: ARM/GNU Linker : 6.3.1
		"C:\Program Files (x86)\Atmel\Studio\7.0\toolchain\arm\arm-gnu-toolchain\bin\arm-none-eabi-gcc.exe" -o SAME70_USB_MSC.elf  src/ASF/common/services/usb/class/msc/device/example/same70q21_same70_xplained/ui.o src/ASF/common/components/memory/virtual_mem/virtual_mem.o src/ASF/common/services/clock/same70/sysclk.o src/ASF/common/services/sleepmgr/sam/sleepmgr.o src/ASF/common/services/storage/ctrl_access/ctrl_access.o src/ASF/common/services/usb/class/msc/device/udi_msc.o src/ASF/common/services/usb/class/msc/device/udi_msc_desc.o src/ASF/common/services/usb/udc/udc.o src/ASF/common/utils/interrupt/interrupt_sam_nvic.o src/ASF/sam/boards/same70_xplained/init.o src/ASF/sam/drivers/mpu/mpu.o src/ASF/sam/drivers/pio/pio.o src/ASF/sam/drivers/pio/pio_handler.o src/ASF/sam/drivers/pmc/pmc.o src/ASF/sam/drivers/pmc/sleep.o src/ASF/sam/drivers/usbhs/usbhs_device.o src/ASF/sam/utils/cmsis/same70/source/templates/gcc/startup_same70.o src/ASF/sam/utils/cmsis/same70/source/templates/system_same70.o src/ASF/sam/utils/syscalls/gcc/syscalls.o src/main.o src/memories_initialization_sam.o   -mthumb -Wl,-Map="SAME70_USB_MSC.map" -Wl,--start-group -larm_cortexM7lfsp_math_softfp -lm  -Wl,--end-group -L"../src/ASF/thirdparty/CMSIS/Lib/GCC"  -Wl,--gc-sections -mcpu=cortex-m7 -Wl,--entry=Reset_Handler -Wl,--cref -mthumb -T../src/ASF/sam/utils/linker_scripts/same70/same70q21/gcc/flash.ld  
		Finished building target: SAME70_USB_MSC.elf
		"C:\Program Files (x86)\Atmel\Studio\7.0\toolchain\arm\arm-gnu-toolchain\bin\arm-none-eabi-objcopy.exe" -O binary "SAME70_USB_MSC.elf" "SAME70_USB_MSC.bin"
		"C:\Program Files (x86)\Atmel\Studio\7.0\toolchain\arm\arm-gnu-toolchain\bin\arm-none-eabi-objcopy.exe" -O ihex -R .eeprom -R .fuse -R .lock -R .signature  "SAME70_USB_MSC.elf" "SAME70_USB_MSC.hex"
		"C:\Program Files (x86)\Atmel\Studio\7.0\toolchain\arm\arm-gnu-toolchain\bin\arm-none-eabi-objcopy.exe" -j .eeprom --set-section-flags=.eeprom=alloc,load --change-section-lma .eeprom=0 --no-change-warnings -O binary "SAME70_USB_MSC.elf" "SAME70_USB_MSC.eep" || exit 0
		"C:\Program Files (x86)\Atmel\Studio\7.0\toolchain\arm\arm-gnu-toolchain\bin\arm-none-eabi-objdump.exe" -h -S "SAME70_USB_MSC.elf" > "SAME70_USB_MSC.lss"
		"C:\Program Files (x86)\Atmel\Studio\7.0\toolchain\arm\arm-gnu-toolchain\bin\arm-none-eabi-objcopy.exe" -O srec -R .eeprom -R .fuse -R .lock -R .signature  "SAME70_USB_MSC.elf" "SAME70_USB_MSC.srec"
		"C:\Program Files (x86)\Atmel\Studio\7.0\toolchain\arm\arm-gnu-toolchain\bin\arm-none-eabi-size.exe" "SAME70_USB_MSC.elf"
		   text	   data	    bss	    dec	    hex	filename
		  13148	   1276	  33684	  48108	   bbec	SAME70_USB_MSC.elf
	Done executing task "RunCompilerTask".
	Using "RunOutputFileVerifyTask" task from assembly "C:\Program Files (x86)\Atmel\Studio\7.0\Extensions\Application\AvrGCC.dll".
	Task "RunOutputFileVerifyTask"
				Program Memory Usage 	:	14424 bytes   0.7 % Full
				Data Memory Usage 		:	34960 bytes   8.9 % Full
	Done executing task "RunOutputFileVerifyTask".
Done building target "CoreBuild" in project "SAME70_USB_MSC.cproj".
Target "PostBuildEvent" skipped, due to false condition; ('$(PostBuildEvent)' != '') was evaluated as ('' != '').
Target "Build" in file "C:\Program Files (x86)\Atmel\Studio\7.0\Vs\Avr.common.targets" from project "E:\Projects\AtmelStudio\SAME70_USB_MSC\SAME70_USB_MSC\SAME70_USB_MSC.cproj" (entry point):
Done building target "Build" in project "SAME70_USB_MSC.cproj".
Done building project "SAME70_USB_MSC.cproj".

Build succeeded.
========== Build: 1 succeeded or up-to-date, 0 failed, 0 skipped ==========

 

Daniel